{"text_format":"1","workbook":"xlsx","n_sheets":6,"sheets":["C1 muži","K1 ženy","C2 muži","K1 muži","C1 ženy","bodovani"],"not_rendered":{"charts":0,"images":0,"macros":1,"external_links":0,"defined_names":5,"comments":0,"pivot_tables":0},"unopened":[],"bounds":{"document_bytes":16777216,"sheet_cells":100000,"rows_first":2000,"rows_last":500,"rows_between":2000,"halvings":0,"cell_chars":16384,"cell_head_chars":4096},"cells_cut":0,"cells_raw":0,"read":"whole","date_system":"1900"}

{"sheet":"C1 muži","index":0,"n_rows":24,"n_cols":33,"rows_kept":24,"cut":false,"hidden":false,"merged":[[4,0,5,0],[0,1,0,21],[4,6,4,9],[4,10,4,13],[4,14,4,17],[4,1,5,1],[4,2,4,5]]}
[null,"Výsledky nominace 2013"]
[]
[]
[null,"C1 muži"]
["ID","Jméno","Trnávka - 1",null,null,null,"Trnávka - 2",null,null,null,"Troja - 1",null,null,null,"Troja - 2",null,null,null,"Plus ","BODY","POMĚR","%","POŘ."]
[null,null,"poř.","body","Výsledek","%","poř.","body","výsledek","%","poř.","body","výsledek","%","poř.","body","výsledek","%","Body","CELKEM","VÍTĚZSTVÍ","CELKEM","CELKEM"]
[1,"JÁNĚ M. ",3,{"$f":"IF(ISBLANK($B7),\"\",IF(ISBLANK(C7),0,IF(C7<11,LOOKUP(C7,bodovani!$A$2:$B$11),0)))","v":8},94.25,{"$f":"IF(SUM(E$7:E$24)>0,IF(ISNUMBER(E7),E7/(MIN(E$7:E$24)/100)-100,999),\"0\")","v":0.6084543125533628},2,{"$f":"IF(ISBLANK($B7),\"\",IF(ISBLANK(G7),0,IF(G7<11,LOOKUP(G7,bodovani!$A$2:$B$11),0)))","v":9},93.03,{"$f":"IF(SUM(I$7:I$24)>0,IF(ISNUMBER(I7),I7/(MIN(I$7:I$24)/100)-100,999),\"0\")","v":0.77998050048748269},2,{"$f":"IF(ISBLANK($B7),\"\",IF(ISBLANK(K7),0,IF(K7<11,LOOKUP(K7,bodovani!$A$2:$B$11),0)))","v":9},93.31,{"$f":"IF(SUM(M$7:M$24)>0,IF(ISNUMBER(M7),M7/(MIN(M$7:M$24)/100)-100,999),\"0\")","v":0.60377358490566735},null,{"$f":"IF(ISBLANK($B7),\"\",IF(ISBLANK(O7),0,IF(O7<11,LOOKUP(O7,bodovani!$A$2:$B$11),0)))","v":0},null,{"$f":"IF(SUM(Q$7:Q$24)>0,IF(ISNUMBER(Q7),Q7/(MIN(Q$7:Q$24)/100)-100,999),\"0\")","v":"0"},null,{"$f":"(D7+H7+L7+P7)-MIN(D7,H7,L7,P7)+S7","v":26},null,{"$f":"(F7+J7+N7+R7)-MAX(F7,J7,N7,R7)","v":1.2122278974590301},1,null,null,null,null,null,null,null,20,6,5]
[2,"GEBAS ",5,{"$f":"IF(ISBLANK($B8),\"\",IF(ISBLANK(C8),0,IF(C8<11,LOOKUP(C8,bodovani!$A$2:$B$11),0)))","v":6},95.43,1.8680614859094788,4,{"$f":"IF(ISBLANK($B8),\"\",IF(ISBLANK(G8),0,IF(G8<11,LOOKUP(G8,bodovani!$A$2:$B$11),0)))","v":7},93.48,1.26746831329217,1,{"$f":"IF(ISBLANK($B8),\"\",IF(ISBLANK(K8),0,IF(K8<11,LOOKUP(K8,bodovani!$A$2:$B$11),0)))","v":11},92.75,0,null,{"$f":"IF(ISBLANK($B8),\"\",IF(ISBLANK(O8),0,IF(O8<11,LOOKUP(O8,bodovani!$A$2:$B$11),0)))","v":0},null,"0",null,24,null,1.26746831329217,2,null,null,null,null,null,null,null,19,11,1]
[3,"JEŽEK",2,{"$f":"IF(ISBLANK($B9),\"\",IF(ISBLANK(C9),0,IF(C9<11,LOOKUP(C9,bodovani!$A$2:$B$11),0)))","v":9},93.81,0.13877028181040885,5,{"$f":"IF(ISBLANK($B9),\"\",IF(ISBLANK(G9),0,IF(G9<11,LOOKUP(G9,bodovani!$A$2:$B$11),0)))","v":6},94.76,2.6541003141588106,3,{"$f":"IF(ISBLANK($B9),\"\",IF(ISBLANK(K9),0,IF(K9<11,LOOKUP(K9,bodovani!$A$2:$B$11),0)))","v":8},93.97,1.3153638814016233,null,{"$f":"IF(ISBLANK($B9),\"\",IF(ISBLANK(O9),0,IF(O9<11,LOOKUP(O9,bodovani!$A$2:$B$11),0)))","v":0},null,"0",null,23,null,1.4541341632120321,3,null,null,null,null,null,null,null,16,10,11]
[4,"MAŠEK",4,{"$f":"IF(ISBLANK($B10),\"\",IF(ISBLANK(C10),0,IF(C10<11,LOOKUP(C10,bodovani!$A$2:$B$11),0)))","v":7},95.07,1.4837745516652348,3,{"$f":"IF(ISBLANK($B10),\"\",IF(ISBLANK(G10),0,IF(G10<11,LOOKUP(G10,bodovani!$A$2:$B$11),0)))","v":8},93.18,0.94247643808904513,4,{"$f":"IF(ISBLANK($B10),\"\",IF(ISBLANK(K10),0,IF(K10<11,LOOKUP(K10,bodovani!$A$2:$B$11),0)))","v":7},94.02,1.3692722371967676,null,{"$f":"IF(ISBLANK($B10),\"\",IF(ISBLANK(O10),0,IF(O10<11,LOOKUP(O10,bodovani!$A$2:$B$11),0)))","v":0},null,"0",null,22,null,2.3117486752858127,4,null,null,null,null,null,null,null,16,7,1999]
{"$rows_left_out":15}
{"sheet":"K1 ženy","index":1,"n_rows":25,"n_cols":33,"rows_kept":25,"cut":false,"hidden":false,"merged":[[4,0,5,0],[0,1,0,21],[4,6,4,9],[4,10,4,13],[4,14,4,17],[4,1,5,1],[4,2,4,5]]}
[null,"Výsledky nominace 2013"]
[]
[]
[null,"K1 ženy"]
["ID","Jméno","Trnávka - 1",null,null,null,"Trnávka - 2",null,null,null,"Troja - 1",null,null,null,"Troja - 2",null,null,null,"Plus ","BODY","POMĚR","%","POŘ."]
[null,null,"poř.","body","Výsledek","%","poř.","body","výsledek","%","poř.","body","výsledek","%","poř.","body","výsledek","%","Body","CELKEM","VÍTĚZSTVÍ","CELKEM","CELKEM"]
[1,"HILGERTOVÁ",1,{"$f":"IF(ISBLANK($B7),\"\",IF(ISBLANK(C7),0,IF(C7<11,LOOKUP(C7,bodovani!$A$2:$B$11),0)))","v":11},100.02,{"$f":"IF(SUM(E$7:E$25)>0,IF(ISNUMBER(E7),E7/(MIN(E$7:E$25)/100)-100,999),\"0\")","v":0},4,{"$f":"IF(ISBLANK($B7),\"\",IF(ISBLANK(G7),0,IF(G7<11,LOOKUP(G7,bodovani!$A$2:$B$11),0)))","v":7},101,{"$f":"IF(SUM(I$7:I$25)>0,IF(ISNUMBER(I7),I7/(MIN(I$7:I$25)/100)-100,999),\"0\")","v":2.9246917354529813},1,{"$f":"IF(ISBLANK($B7),\"\",IF(ISBLANK(K7),0,IF(K7<11,LOOKUP(K7,bodovani!$A$2:$B$11),0)))","v":11},102.74,{"$f":"IF(SUM(M$7:M$25)>0,IF(ISNUMBER(M7),M7/(MIN(M$7:M$25)/100)-100,999),\"0\")","v":1.4210854715202004E-14},null,{"$f":"IF(ISBLANK($B7),\"\",IF(ISBLANK(O7),0,IF(O7<11,LOOKUP(O7,bodovani!$A$2:$B$11),0)))","v":0},null,{"$f":"IF(SUM(Q$7:Q$25)>0,IF(ISNUMBER(Q7),Q7/(MIN(Q$7:Q$25)/100)-100,999),\"0\")","v":"0"},null,{"$f":"(D7+H7+L7+P7)-MIN(D7,H7,L7,P7)+S7","v":29},null,{"$f":"(F7+J7+N7+R7)-MAX(F7,J7,N7,R7)","v":1.4210854715202004E-14},1,null,null,null,null,null,null,null,20,1,5]
[2,"KUDĚJOVÁ - 23",2,{"$f":"IF(ISBLANK($B8),\"\",IF(ISBLANK(C8),0,IF(C8<11,LOOKUP(C8,bodovani!$A$2:$B$11),0)))","v":9},101.87,1.8496300739852103,2,{"$f":"IF(ISBLANK($B8),\"\",IF(ISBLANK(G8),0,IF(G8<11,LOOKUP(G8,bodovani!$A$2:$B$11),0)))","v":9},98.77,0.65219606644247108,3,{"$f":"IF(ISBLANK($B8),\"\",IF(ISBLANK(K8),0,IF(K8<11,LOOKUP(K8,bodovani!$A$2:$B$11),0)))","v":8},105.24,2.4333268444617602,null,{"$f":"IF(ISBLANK($B8),\"\",IF(ISBLANK(O8),0,IF(O8<11,LOOKUP(O8,bodovani!$A$2:$B$11),0)))","v":0},null,"0",null,26,null,2.5018261404276814,2,null,null,null,null,null,null,null,19,7,3]
[3,"PAVELKOVÁ",4,{"$f":"IF(ISBLANK($B9),\"\",IF(ISBLANK(C9),0,IF(C9<11,LOOKUP(C9,bodovani!$A$2:$B$11),0)))","v":7},102.43,2.4095180963807366,5,{"$f":"IF(ISBLANK($B9),\"\",IF(ISBLANK(G9),0,IF(G9<11,LOOKUP(G9,bodovani!$A$2:$B$11),0)))","v":6},103.57,5.5436665647610255,4,{"$f":"IF(ISBLANK($B9),\"\",IF(ISBLANK(K9),0,IF(K9<11,LOOKUP(K9,bodovani!$A$2:$B$11),0)))","v":7},106.28,3.4455908117578531,null,{"$f":"IF(ISBLANK($B9),\"\",IF(ISBLANK(O9),0,IF(O9<11,LOOKUP(O9,bodovani!$A$2:$B$11),0)))","v":0},null,"0",null,20,null,5.8551089081385896,3,null,null,null,null,null,null,null,19,4,1999]
[4,"GALUŠKOVÁ - 23",11,{"$f":"IF(ISBLANK($B10),\"\",IF(ISBLANK(C10),0,IF(C10<11,LOOKUP(C10,bodovani!$A$2:$B$11),0)))","v":0},157.31,57.27854429114177,3,{"$f":"IF(ISBLANK($B10),\"\",IF(ISBLANK(G10),0,IF(G10<11,LOOKUP(G10,bodovani!$A$2:$B$11),0)))","v":8},100.53,2.4457352491592843,2,{"$f":"IF(ISBLANK($B10),\"\",IF(ISBLANK(K10),0,IF(K10<11,LOOKUP(K10,bodovani!$A$2:$B$11),0)))","v":9},104.74,1.9466614755693996,null,{"$f":"IF(ISBLANK($B10),\"\",IF(ISBLANK(O10),0,IF(O10<11,LOOKUP(O10,bodovani!$A$2:$B$11),0)))","v":0},null,"0",null,17,null,4.3923967247286839,4,null,null,null,null,null,null,null,18,9,4]
{"$rows_left_out":16}
{"sheet":"C2 muži","index":2,"n_rows":23,"n_cols":33,"rows_kept":23,"cut":false,"hidden":false,"merged":[[4,0,5,0],[0,1,0,21],[4,6,4,9],[4,10,4,13],[4,14,4,17],[4,1,5,1],[4,2,4,5]]}
[null,"Výsledky nominace 2013"]
[]
[]
[null,"C2 muži"]
["ID","Jméno","Trnávka - 1",null,null,null,"Trnávka - 2",null,null,null,"Troja - 1",null,null,null,"Troja - 2",null,null,null,"Plus ","BODY","POMĚR","%","POŘ."]
[null,null,"poř.","body","Výsledek","%","poř.","body","výsledek","%","poř.","body","výsledek","%","poř.","body","výsledek","%","Body","CELKEM","VÍTĚZSTVÍ","CELKEM",0]
[1,"Kašpar - Šindler - 23",1,{"$f":"IF(ISBLANK($B7),\"\",IF(ISBLANK(C7),0,IF(C7<11,LOOKUP(C7,bodovani!$A$2:$B$11),0)))","v":11},95.09,{"$f":"IF(SUM(E$7:E$23)>0,IF(ISNUMBER(E7),E7/(MIN(E$7:E$23)/100)-100,999),\"0\")","v":0},1,{"$f":"IF(ISBLANK($B7),\"\",IF(ISBLANK(G7),0,IF(G7<11,LOOKUP(G7,bodovani!$A$2:$B$11),0)))","v":11},95.91,{"$f":"IF(SUM(I$7:I$23)>0,IF(ISNUMBER(I7),I7/(MIN(I$7:I$23)/100)-100,999),\"0\")","v":0},2,{"$f":"IF(ISBLANK($B7),\"\",IF(ISBLANK(K7),0,IF(K7<11,LOOKUP(K7,bodovani!$A$2:$B$11),0)))","v":9},101.87,{"$f":"IF(SUM(M$7:M$23)>0,IF(ISNUMBER(M7),M7/(MIN(M$7:M$23)/100)-100,999),\"0\")","v":0.91134224863793634},null,{"$f":"IF(ISBLANK($B7),\"\",IF(ISBLANK(O7),0,IF(O7<11,LOOKUP(O7,bodovani!$A$2:$B$11),0)))","v":0},null,{"$f":"IF(SUM(Q$7:Q$23)>0,IF(ISNUMBER(Q7),Q7/(MIN(Q$7:Q$23)/100)-100,999),\"0\")","v":"0"},null,{"$f":"(D7+H7+L7+P7)-MIN(D7,H7,L7,P7)+S7","v":31},null,{"$f":"(F7+J7+N7+R7)-MAX(F7,J7,N7,R7)","v":0},1,null,null,null,null,null,null,null,20,1,5]
[2,"Karlovský - Jáně -23",2,{"$f":"IF(ISBLANK($B8),\"\",IF(ISBLANK(C8),0,IF(C8<11,LOOKUP(C8,bodovani!$A$2:$B$11),0)))","v":9},98.31,3.386265643074978,3,{"$f":"IF(ISBLANK($B8),\"\",IF(ISBLANK(G8),0,IF(G8<11,LOOKUP(G8,bodovani!$A$2:$B$11),0)))","v":8},99.99,4.2539881138567353,1,{"$f":"IF(ISBLANK($B8),\"\",IF(ISBLANK(K8),0,IF(K8<11,LOOKUP(K8,bodovani!$A$2:$B$11),0)))","v":11},100.95,0,null,{"$f":"IF(ISBLANK($B8),\"\",IF(ISBLANK(O8),0,IF(O8<11,LOOKUP(O8,bodovani!$A$2:$B$11),0)))","v":0},null,"0",null,28,null,3.386265643074978,2,null,null,null,null,null,null,null,19,7,3]
[3,"Havlíček - Přinda",3,{"$f":"IF(ISBLANK($B9),\"\",IF(ISBLANK(C9),0,IF(C9<11,LOOKUP(C9,bodovani!$A$2:$B$11),0)))","v":8},103.09,8.4130823430434276,2,{"$f":"IF(ISBLANK($B9),\"\",IF(ISBLANK(G9),0,IF(G9<11,LOOKUP(G9,bodovani!$A$2:$B$11),0)))","v":9},99.25,3.4824314461474302,3,{"$f":"IF(ISBLANK($B9),\"\",IF(ISBLANK(K9),0,IF(K9<11,LOOKUP(K9,bodovani!$A$2:$B$11),0)))","v":8},105.62,4.6260525012382345,null,{"$f":"IF(ISBLANK($B9),\"\",IF(ISBLANK(O9),0,IF(O9<11,LOOKUP(O9,bodovani!$A$2:$B$11),0)))","v":0},null,"0",null,25,null,8.1084839473856647,3,null,null,null,null,null,null,null,19,4,1999]
[4,"Koplík - Vrzáň ",4,{"$f":"IF(ISBLANK($B10),\"\",IF(ISBLANK(C10),0,IF(C10<11,LOOKUP(C10,bodovani!$A$2:$B$11),0)))","v":7},104.02,9.3911031654222228,4,{"$f":"IF(ISBLANK($B10),\"\",IF(ISBLANK(G10),0,IF(G10<11,LOOKUP(G10,bodovani!$A$2:$B$11),0)))","v":7},100.92,5.2236471692211524,7,{"$f":"IF(ISBLANK($B10),\"\",IF(ISBLANK(K10),0,IF(K10<11,LOOKUP(K10,bodovani!$A$2:$B$11),0)))","v":4},113.68,12.61020307082714,null,{"$f":"IF(ISBLANK($B10),\"\",IF(ISBLANK(O10),0,IF(O10<11,LOOKUP(O10,bodovani!$A$2:$B$11),0)))","v":0},null,"0",null,18,2,14.614750334643375,4,null,null,null,null,null,null,null,18,9,4]
{"$rows_left_out":14}
{"sheet":"K1 muži","index":3,"n_rows":22,"n_cols":33,"rows_kept":22,"cut":false,"hidden":false,"merged":[[4,0,5,0],[53,2,53,5],[40,1,41,1],[23,10,23,13],[4,2,4,5],[53,1,54,1],[23,2,23,5],[23,6,23,9],[53,10,53,13],[23,1,24,1],[53,14,53,17],[53,6,53,9],[40,2,40,5],[40,6,40,9],[40,10,40,13],[40,14,40,17],[23,14,23,17],[0,1,0,21],[4,6,4,9],[4,10,4,13],[4,14,4,17],[4,1,5,1]]}
[null,"Výsledky nominace 2013"]
[]
[]
[null,"K1 muži"]
["ID","Jméno","Trnávka - 1",null,null,null,"Trnávka - 2",null,null,null,"Troja - 1",null,null,null,"Troja - 2",null,null,null,"Plus ","BODY","POMĚR","%","POŘ."]
[null,null,"poř.","body","Výsledek","%","poř.","body","výsledek","%","poř.","body","výsledek","%","poř.","body","výsledek","%","Body","CELKEM","VÍTĚZSTVÍ","CELKEM","CELKEM"]
[1,"PŘINDIŠ V. ",2,{"$f":"IF(ISBLANK($B7),\"\",IF(ISBLANK(C7),0,IF(C7<11,LOOKUP(C7,bodovani!$A$2:$B$11),0)))","v":9},87.78,{"$f":"IF(SUM(E$7:E$22)>0,IF(ISNUMBER(E7),E7/(MIN(E$7:E$22)/100)-100,999),\"0\")","v":0.27416038382453678},2,{"$f":"IF(ISBLANK($B7),\"\",IF(ISBLANK(G7),0,IF(G7<11,LOOKUP(G7,bodovani!$A$2:$B$11),0)))","v":9},89.19,{"$f":"IF(SUM(I$7:I$22)>0,IF(ISNUMBER(I7),I7/(MIN(I$7:I$22)/100)-100,999),\"0\")","v":4.0966386554621721},5,{"$f":"IF(ISBLANK($B7),\"\",IF(ISBLANK(K7),0,IF(K7<11,LOOKUP(K7,bodovani!$A$2:$B$11),0)))","v":6},88.61,{"$f":"IF(SUM(M$7:M$22)>0,IF(ISNUMBER(M7),M7/(MIN(M$7:M$22)/100)-100,999),\"0\")","v":4.3698468786807894},null,{"$f":"IF(ISBLANK($B7),\"\",IF(ISBLANK(O7),0,IF(O7<11,LOOKUP(O7,bodovani!$A$2:$B$11),0)))","v":0},null,{"$f":"IF(SUM(Q$7:Q$22)>0,IF(ISNUMBER(Q7),Q7/(MIN(Q$7:Q$22)/100)-100,999),\"0\")","v":"0"},null,{"$f":"(D7+H7+L7+P7)-MIN(D7,H7,L7,P7)+S7","v":24},1,{"$f":"(F7+J7+N7+R7)-MAX(F7,J7,N7,R7)","v":4.3707990392867089},2,null,null,null,null,null,null,null,25,10,1]
[2,"VONDRA ",5,{"$f":"IF(ISBLANK($B8),\"\",IF(ISBLANK(C8),0,IF(C8<11,LOOKUP(C8,bodovani!$A$2:$B$11),0)))","v":6},88.48,{"$f":"IF(SUM(E$7:E$22)>0,IF(ISNUMBER(E8),E8/(MIN(E$7:E$22)/100)-100,999),\"0\")","v":1.0737948366461012},1,{"$f":"IF(ISBLANK($B8),\"\",IF(ISBLANK(G8),0,IF(G8<11,LOOKUP(G8,bodovani!$A$2:$B$11),0)))","v":11},85.68,{"$f":"IF(SUM(I$7:I$22)>0,IF(ISNUMBER(I8),I8/(MIN(I$7:I$22)/100)-100,999),\"0\")","v":0},4,{"$f":"IF(ISBLANK($B8),\"\",IF(ISBLANK(K8),0,IF(K8<11,LOOKUP(K8,bodovani!$A$2:$B$11),0)))","v":7},87.73,{"$f":"IF(SUM(M$7:M$22)>0,IF(ISNUMBER(M8),M8/(MIN(M$7:M$22)/100)-100,999),\"0\")","v":3.3333333333333286},null,{"$f":"IF(ISBLANK($B8),\"\",IF(ISBLANK(O8),0,IF(O8<11,LOOKUP(O8,bodovani!$A$2:$B$11),0)))","v":0},null,{"$f":"IF(SUM(Q$7:Q$22)>0,IF(ISNUMBER(Q8),Q8/(MIN(Q$7:Q$22)/100)-100,999),\"0\")","v":"0"},null,24,2,1.0737948366461012,1,null,null,null,null,null,null,null,19,7,8]
[5,"PRSKAVEC - 23",3,{"$f":"IF(ISBLANK($B9),\"\",IF(ISBLANK(C9),0,IF(C9<11,LOOKUP(C9,bodovani!$A$2:$B$11),0)))","v":8},88,{"$f":"IF(SUM(E$7:E$22)>0,IF(ISNUMBER(E9),E9/(MIN(E$7:E$22)/100)-100,999),\"0\")","v":0.52547406899702764},10,{"$f":"IF(ISBLANK($B9),\"\",IF(ISBLANK(G9),0,IF(G9<11,LOOKUP(G9,bodovani!$A$2:$B$11),0)))","v":1},86.64,{"$f":"IF(SUM(I$7:I$22)>0,IF(ISNUMBER(I9),I9/(MIN(I$7:I$22)/100)-100,999),\"0\")","v":1.1204481792716905},1,{"$f":"IF(ISBLANK($B9),\"\",IF(ISBLANK(K9),0,IF(K9<11,LOOKUP(K9,bodovani!$A$2:$B$11),0)))","v":11},84.9,{"$f":"IF(SUM(M$7:M$22)>0,IF(ISNUMBER(M9),M9/(MIN(M$7:M$22)/100)-100,999),\"0\")","v":0},null,{"$f":"IF(ISBLANK($B9),\"\",IF(ISBLANK(O9),0,IF(O9<11,LOOKUP(O9,bodovani!$A$2:$B$11),0)))","v":0},null,{"$f":"IF(SUM(Q$7:Q$22)>0,IF(ISNUMBER(Q9),Q9/(MIN(Q$7:Q$22)/100)-100,999),\"0\")","v":"0"},null,{"$f":"(D9+H9+L9+P9)-MIN(D9,H9,L9,P9)+S9","v":20},null,{"$f":"(F9+J9+N9+R9)-MAX(F9,J9,N9,R9)","v":0.52547406899702764},3,null,null,null,null,null,null,null,14,3,1999]
[3,"HILGERT ",1,{"$f":"IF(ISBLANK($B10),\"\",IF(ISBLANK(C10),0,IF(C10<11,LOOKUP(C10,bodovani!$A$2:$B$11),0)))","v":11},87.54,{"$f":"IF(SUM(E$7:E$22)>0,IF(ISNUMBER(E10),E10/(MIN(E$7:E$22)/100)-100,999),\"0\")","v":0},5,{"$f":"IF(ISBLANK($B10),\"\",IF(ISBLANK(G10),0,IF(G10<11,LOOKUP(G10,bodovani!$A$2:$B$11),0)))","v":6},91.19,{"$f":"IF(SUM(I$7:I$22)>0,IF(ISNUMBER(I10),I10/(MIN(I$7:I$22)/100)-100,999),\"0\")","v":6.4309056956115569},null,{"$f":"IF(ISBLANK($B10),\"\",IF(ISBLANK(K10),0,IF(K10<11,LOOKUP(K10,bodovani!$A$2:$B$11),0)))","v":0},null,{"$f":"IF(SUM(M$7:M$22)>0,IF(ISNUMBER(M10),M10/(MIN(M$7:M$22)/100)-100,999),\"0\")","v":999},null,{"$f":"IF(ISBLANK($B10),\"\",IF(ISBLANK(O10),0,IF(O10<11,LOOKUP(O10,bodovani!$A$2:$B$11),0)))","v":0},null,{"$f":"IF(SUM(Q$7:Q$22)>0,IF(ISNUMBER(Q10),Q10/(MIN(Q$7:Q$22)/100)-100,999),\"0\")","v":"0"},null,17,null,6.4309056956115001,4,null,null,null,null,null,null,null,17,9,5]
{"$rows_left_out":13}
{"sheet":"C1 ženy","index":4,"n_rows":26,"n_cols":33,"rows_kept":26,"cut":false,"hidden":false,"merged":[[0,1,0,21],[4,0,5,0],[4,1,5,1],[4,2,4,5],[4,6,4,9],[4,14,4,17],[4,10,4,13],[57,14,57,17],[27,1,28,1],[27,2,27,5],[44,14,44,17],[27,6,27,9],[27,10,27,13],[27,14,27,17],[44,1,45,1],[44,2,44,5],[44,6,44,9],[44,10,44,13],[57,1,58,1],[57,2,57,5],[57,6,57,9],[57,10,57,13]]}
[null,"Výsledky nominace 2013"]
[]
[]
[null,"C1 ženy"]
["ID","Jméno","Trnávka - 1",null,null,null,"Trnávka - 2",null,null,null,"Troja - 1",null,null,null,"Troja - 2",null,null,null,"Plus ","BODY","POMĚR","%","POŘ."]
[null,null,"poř.","body","Výsledek","%","poř.","body","výsledek","%","poř.","body","výsledek","%","poř.","body","výsledek","%","Body","CELKEM","VÍTĚZSTVÍ","CELKEM","CELKEM"]
[1,"HOŠKOVÁ",2,{"$f":"IF(ISBLANK($B7),\"\",IF(ISBLANK(C7),0,IF(C7<11,LOOKUP(C7,bodovani!$A$2:$B$11),0)))","v":9},189.54,{"$f":"IF(SUM(E$7:E$26)>0,IF(ISNUMBER(E7),E7/(MIN(E$7:E$26)/100)-100,999),\"0\")","v":43.73246379009629},1,{"$f":"IF(ISBLANK($B7),\"\",IF(ISBLANK(G7),0,IF(G7<11,LOOKUP(G7,bodovani!$A$2:$B$11),0)))","v":11},114.21,{"$f":"IF(SUM(I$7:I$26)>0,IF(ISNUMBER(I7),I7/(MIN(I$7:I$26)/100)-100,999),\"0\")","v":0},1,{"$f":"IF(ISBLANK($B7),\"\",IF(ISBLANK(K7),0,IF(K7<11,LOOKUP(K7,bodovani!$A$2:$B$11),0)))","v":11},123.53,{"$f":"IF(SUM(M$7:M$26)>0,IF(ISNUMBER(M7),M7/(MIN(M$7:M$26)/100)-100,999),\"0\")","v":0},null,{"$f":"IF(ISBLANK($B7),\"\",IF(ISBLANK(O7),0,IF(O7<11,LOOKUP(O7,bodovani!$A$2:$B$11),0)))","v":0},null,{"$f":"IF(SUM(Q$7:Q$26)>0,IF(ISNUMBER(Q7),Q7/(MIN(Q$7:Q$26)/100)-100,999),\"0\")","v":"0"},null,{"$f":"(D7+H7+L7+P7)-MIN(D7,H7,L7,P7)+S7","v":31},null,{"$f":"(F7+J7+N7+R7)-MAX(F7,J7,N7,R7)","v":0},1,null,null,null,null,null,null,null,25,10,1]
[2,"JANČOVÁ - 23 ",1,{"$f":"IF(ISBLANK($B8),\"\",IF(ISBLANK(C8),0,IF(C8<11,LOOKUP(C8,bodovani!$A$2:$B$11),0)))","v":11},131.87,0,2,{"$f":"IF(ISBLANK($B8),\"\",IF(ISBLANK(G8),0,IF(G8<11,LOOKUP(G8,bodovani!$A$2:$B$11),0)))","v":9},181.91,59.276770860695223,2,{"$f":"IF(ISBLANK($B8),\"\",IF(ISBLANK(K8),0,IF(K8<11,LOOKUP(K8,bodovani!$A$2:$B$11),0)))","v":9},125.87,1.8942766939205029,null,{"$f":"IF(ISBLANK($B8),\"\",IF(ISBLANK(O8),0,IF(O8<11,LOOKUP(O8,bodovani!$A$2:$B$11),0)))","v":0},null,"0",null,29,null,1.8942766939205029,2,null,null,null,null,null,null,null,19,7,8]
[3,"ČEKALOVÁ - 23",3,{"$f":"IF(ISBLANK($B9),\"\",IF(ISBLANK(C9),0,IF(C9<11,LOOKUP(C9,bodovani!$A$2:$B$11),0)))","v":8},205.1,55.531963297186621,5,{"$f":"IF(ISBLANK($B9),\"\",IF(ISBLANK(G9),0,IF(G9<11,LOOKUP(G9,bodovani!$A$2:$B$11),0)))","v":6},232.96,103.97513352596098,7,{"$f":"IF(ISBLANK($B9),\"\",IF(ISBLANK(K9),0,IF(K9<11,LOOKUP(K9,bodovani!$A$2:$B$11),0)))","v":4},154.72999999999999,25.25702258560672,null,{"$f":"IF(ISBLANK($B9),\"\",IF(ISBLANK(O9),0,IF(O9<11,LOOKUP(O9,bodovani!$A$2:$B$11),0)))","v":0},null,"0",null,18,2,80.788985882793327,3,null,null,null,null,null,null,null,17,9,5]
[4,"KOBLENCOVÁ - 23",5,{"$f":"IF(ISBLANK($B10),\"\",IF(ISBLANK(C10),0,IF(C10<11,LOOKUP(C10,bodovani!$A$2:$B$11),0)))","v":6},228.54,73.307044816865101,7,{"$f":"IF(ISBLANK($B10),\"\",IF(ISBLANK(G10),0,IF(G10<11,LOOKUP(G10,bodovani!$A$2:$B$11),0)))","v":4},294.97000000000003,158.26985377812804,3,{"$f":"IF(ISBLANK($B10),\"\",IF(ISBLANK(K10),0,IF(K10<11,LOOKUP(K10,bodovani!$A$2:$B$11),0)))","v":8},135.19999999999999,9.4470978709625086,null,{"$f":"IF(ISBLANK($B10),\"\",IF(ISBLANK(O10),0,IF(O10<11,LOOKUP(O10,bodovani!$A$2:$B$11),0)))","v":0},null,"0",null,18,1,82.754142687827596,4,null,null,null,null,null,null,null,14,13,11]
{"$rows_left_out":17}
{"sheet":"bodovani","index":5,"n_rows":11,"n_cols":2,"rows_kept":11,"cut":false,"hidden":false,"merged":[]}
["Pořadí","Body"]
[1,11]
[2,9]
[3,8]
[4,7]
[5,6]
[6,5]
[7,4]
[8,3]
[9,2]
{"$rows_left_out":1}